FATE

78.9719626168224%
17.7570093457944%
3.27102803738318%
TimeRevArchOSCompilerCommentWarningsTests
41 minutes agoN-120855-g2296a9c1bcaarch64darwinApple clang version 12.0.5 (clang-1205.0.22.9)macOS 11 SDK
29 minutes agoN-120855-g2296a9c1bcaarch64darwinApple clang version 13.0.0 (clang-1300.0.29.30)iOS 15
32 minutes agoN-120855-g2296a9c1bcaarch64darwinApple clang version 13.0.0 (clang-1300.0.29.30)iOS 9
17 minutes agoN-120855-g2296a9c1bcaarch64darwinApple clang version 13.0.0 (clang-1300.0.29.30)macOS 12 SDK / Xcode 13
49 minutes agoN-120855-g2296a9c1bcaarch64darwinApple clang version 13.0.0 (clang-1300.0.29.30)tvOS 12
51 minutes agoN-120855-g2296a9c1bcaarch64darwinApple clang version 13.0.0 (clang-1300.0.29.30)tvOS 9
27 minutes agoN-120855-g2296a9c1bcaarch64darwinApple clang version 14.0.0 (clang-1400.0.29.202)iOS 16
79 minutes agoN-120855-g2296a9c1bcaarch64darwinApple clang version 14.0.0 (clang-1400.0.29.202)macOS 13 SDK / Xcode 14
25 minutes agoN-120855-g2296a9c1bcaarch64darwinApple clang version 15.0.0 (clang-1500.3.9.4)iOS 17
73 minutes agoN-120855-g2296a9c1bcaarch64darwinApple clang version 15.0.0 (clang-1500.3.9.4)macOS 14 SDK / Xcode 15
23 minutes agoN-120855-g2296a9c1bcaarch64darwinApple clang version 16.0.0 (clang-1600.0.26.6)iOS 18
68 minutes agoN-120855-g2296a9c1bcaarch64darwinApple clang version 16.0.0 (clang-1600.0.26.6)macOS 15 SDK / Xcode 16
47 minutes agoN-120855-g2296a9c1bcaarch64darwinApple clang version 16.0.0 (clang-1600.0.26.6)tvOS 18
5 hours agoN-120851-g7a774829f9aarch64linuxclang version 22.0.0git (https%3a//github.com/llvm/llvm-project 6dfd8d0ab46e64d0c30d2b9c60f212b50171fc9d)
4 hours agoN-120851-g7a774829f9aarch64linuxclang version 22.0.0git (https%3a//github.com/llvm/llvm-project 6dfd8d0ab46e64d0c30d2b9c60f212b50171fc9d)QEMU, PAC+BTI
4 hours agoN-120851-g7a774829f9aarch64linuxgcc 13 (Ubuntu 13.3.0-6ubuntu2~24.04)
3 hours agoN-120851-g7a774829f9aarch64linuxgcc 13 (Ubuntu 13.3.0-6ubuntu2~24.04)QEMU
39 hours agoN-120848-g2fffa01ddbaarch64linuxgcc 16 (Debian 20250828-1)GCC ARM64
3 hours agoN-120851-g7a774829f9aarch64linuxUbuntu clang version 18.1.3 (1ubuntu1)
39 hours agoN-120848-g2fffa01ddbaarch64linuxUbuntu clang version 18.1.3 (1ubuntu1)Clang ASAN/UBSAN/ASM
2 failed testsStatus
checkasm-sw_gbrp1
checkasm-sw_rgb1
4 hours agoN-120851-g7a774829f9aarch64mingw32clang version 22.0.0git (https%3a//github.com/llvm/llvm-project 6dfd8d0ab46e64d0c30d2b9c60f212b50171fc9d)
26 hours agoN-120848-g2fffa01ddbaarch64win32clang version 22.0.0git (https%3a//github.com/llvm/llvm-project 794f82edfcec16df3f8ab97efd6901d0e6c62468)MSVC 2022 SDK
3 hours agoN-120851-g7a774829f9aarch64win32Microsoft (R) C/C++ Optimizing Compiler Version 19.41.34120 for ARM64gas-preprocessor
39 hours agoN-120846-g4ede75b5f4aarch64win64clang version 19.1.5VS2022 Clang ARM64
40 hours agoN-120846-g4ede75b5f4aarch64win64clang version 19.1.5VS2022 Clang ARM64 (shared)
39 hours agoN-120846-g4ede75b5f4aarch64win64clang version 19.1.5VS2022 Clang-CL ARM64
40 hours agoN-120846-g4ede75b5f4aarch64win64clang version 19.1.5VS2022 Clang-CL ARM64 (shared)
3 days agoN-120841-g041651841aaarch64win64clang version 20.1.8MSYS2 clang ARM64 Native
39 hours agoN-120846-g4ede75b5f4aarch64win64Microsoft (R) C/C++ Optimizing Compiler Version 19.44.35213 for ARM64VS2022 MSVC ARM64
39 hours agoN-120846-g4ede75b5f4aarch64win64Microsoft (R) C/C++ Optimizing Compiler Version 19.44.35213 for ARM64VS2022 MSVC ARM64 (Assert Level 2)
39 hours agoN-120846-g4ede75b5f4aarch64win64Microsoft (R) C/C++ Optimizing Compiler Version 19.44.35213 for ARM64VS2022 MSVC ARM64 (Debug)
40 hours agoN-120846-g4ede75b5f4aarch64win64Microsoft (R) C/C++ Optimizing Compiler Version 19.44.35213 for ARM64VS2022 MSVC ARM64 (shared)
3 days agoN-120841-g041651841aaarch64win64Microsoft (R) C/C++ Optimizing Compiler Version 19.44.35215 for ARM64Visual Studio 2022 ARM64 Native
5 days agoN-120833-gdb2af6fd42alphalinuxgcc 11 (Ubuntu 11.4.0-1ubuntu1~22.04)
3 failed testsStatus
filter-waveform_column1
filter-waveform_envelope1
filter-waveform_uv1
7 days agon5.1.7alphalinuxgcc 11 (Ubuntu 11.4.0-1ubuntu1~22.04)
4 failed testsStatus
filter-waveform_column1
filter-waveform_envelope1
filter-waveform_uv1
vc1_ilaced_twomv1
7 days agon6.1.3alphalinuxgcc 11 (Ubuntu 11.4.0-1ubuntu1~22.04)
4 failed testsStatus
filter-waveform_column1
filter-waveform_envelope1
filter-waveform_uv1
vc1_ilaced_twomv1
7 days agon7.0.3alphalinuxgcc 11 (Ubuntu 11.4.0-1ubuntu1~22.04)
4 failed testsStatus
filter-waveform_column1
filter-waveform_envelope1
filter-waveform_uv1
vc1_ilaced_twomv1
7 days agon7.1.1-57-g1b48158a23alphalinuxgcc 11 (Ubuntu 11.4.0-1ubuntu1~22.04)
3 failed testsStatus
filter-waveform_column1
filter-waveform_envelope1
filter-waveform_uv1
5 days agoN-120833-gdb2af6fd42alphalinuxgcc 11 (Ubuntu 11.4.0-1ubuntu1~22.04)--enable-shared
AR	libavcodec/libavcodec.a
GENTEXI	doc/avoptions_codec.texi
POD	doc/ffmpeg.pod
POD	doc/ffprobe.pod
POD	doc/ffmpeg-all.pod
POD	doc/ffprobe-all.pod
POD	doc/ffmpeg-scaler.pod
POD	doc/ffmpeg-utils.pod
POD	doc/ffmpeg-resampler.pod
POD	doc/ffmpeg-codecs.pod
POD	doc/ffmpeg-bitstream-filters.pod
POD	doc/ffmpeg-formats.pod
POD	doc/ffmpeg-protocols.pod
POD	doc/ffmpeg-devices.pod
POD	doc/ffmpeg-filters.pod
POD	doc/libavutil.pod
collect2: fatal error: ld terminated with signal 11 [Segmentation fault], core dumped
compilation terminated.
make: *** [/home/fate/ffmpeg/ffbuild/library.mak:132: libavutil/libavutil.so.60] Error 1
make: *** Waiting for unfinished jobs....
7 days agon5.1.7alphalinuxgcc 11 (Ubuntu 11.4.0-1ubuntu1~22.04)--enable-shared
7 days agon6.1.3alphalinuxgcc 11 (Ubuntu 11.4.0-1ubuntu1~22.04)--enable-shared
7 days agon7.0.3alphalinuxgcc 11 (Ubuntu 11.4.0-1ubuntu1~22.04)--enable-shared
7 days agon7.1.1-57-g1b48158a23alphalinuxgcc 11 (Ubuntu 11.4.0-1ubuntu1~22.04)--enable-shared
CC	fftools/objpool.o
CC	fftools/sync_queue.o
CC	fftools/thread_queue.o
CC	fftools/cmdutils.o
CC	fftools/opt_common.o
CC	fftools/ffmpeg.o
CC	fftools/ffprobe.o
LD	libavutil/libavutil.so.59
GEN	libavcodec/libavcodec.ver
AR	libavcodec/libavcodec.a
GENTEXI	doc/avoptions_format.texi
GENTEXI	doc/avoptions_codec.texi
POD	doc/ffmpeg.pod
POD	doc/ffprobe.pod
POD	doc/ffmpeg-all.pod
POD	doc/ffprobe-all.pod
collect2: fatal error: ld terminated with signal 11 [Segmentation fault], core dumped
compilation terminated.
make: *** [/home/fate/ffmpeg/ffbuild/library.mak:119: libavutil/libavutil.so.59] Error 1
make: *** Waiting for unfinished jobs....
5 hours agoN-120851-g7a774829f9armv7alinuxclang version 22.0.0git (https%3a//github.com/llvm/llvm-project 6dfd8d0ab46e64d0c30d2b9c60f212b50171fc9d)
4 hours agoN-120851-g7a774829f9armv7alinuxgcc 13 (Ubuntu 13.3.0-6ubuntu2~24.04)
3 hours agoN-120851-g7a774829f9armv7alinuxUbuntu clang version 18.1.3 (1ubuntu1)
4 hours agoN-120851-g7a774829f9armv7amingw32clang version 22.0.0git (https%3a//github.com/llvm/llvm-project 6dfd8d0ab46e64d0c30d2b9c60f212b50171fc9d)
2 hours agoN-120851-g7a774829f9armv7awin32clang version 22.0.0git (https%3a//github.com/llvm/llvm-project 6dfd8d0ab46e64d0c30d2b9c60f212b50171fc9d)MSVC 2022 SDK
27 hours agoN-120848-g2fffa01ddbarmv7awin32Microsoft (R) C/C++ Optimizing Compiler Version 19.38.33130 for ARMgas-preprocessor
39 hours agoN-120848-g2fffa01ddbclinuxUbuntu clang version 18.1.3 (1ubuntu1)Clang ASAN/UBSAN
2025-08-02N-120440-g2b522f537fcwin64Microsoft (R) C/C++ Optimizing Compiler Version 19.44.35213 for ARM64VS2022 MSVC ARM64 (ASAN)
5 days agoN-120833-gdb2af6fd42mipslinuxgcc 10 (Ubuntu 10.3.0-1ubuntu1)
3 failed testsStatus
sub-aqtitle234
sub-charenc234
sub-subviewer1234
7 days agon5.1.7mipslinuxgcc 10 (Ubuntu 10.3.0-1ubuntu1)
9 failed testsStatus
filter-metadata-signalstats-yuv420p101
filter-overlay_yuv420p101
hevc-small422chroma1
pixlet-rgb1
sub-aqtitle1
sub-charenc1
sub-subviewer11
sub2video_basic1
sub2video_time_limited1
7 days agon6.1.3mipslinuxgcc 10 (Ubuntu 10.3.0-1ubuntu1)
41 failed testsStatus
filter-bwdif10234
filter-curves1
filter-metadata-signalstats-yuv420p101
filter-yadif10234
filter-yadif16234
hevc-small422chroma1
magicyuv-rgb1
magicyuv-rgba1
magicyuv-y400i1
magicyuv-y4201
magicyuv-y422i1
magicyuv-y4441
magicyuv-y4444i1
mxf-probe-j2k1
pixlet-rgb1
sub-aqtitle234
sub-charenc234
sub-subviewer1234
sub2video_basic1
sub2video_time_limited1
utvideo_rgb_int_gradient1
utvideo_rgb_int_median1
utvideo_rgb_left1
utvideo_rgb_median1
utvideo_rgba_gradient1
utvideo_rgba_left1
utvideo_rgba_median1
utvideo_yuv420_gradient1
utvideo_yuv420_int_gradient1
utvideo_yuv420_int_median1
utvideo_yuv420_left1
utvideo_yuv420_median1
utvideo_yuv422_gradient1
utvideo_yuv422_int_gradient1
utvideo_yuv422_int_median1
utvideo_yuv422_left1
utvideo_yuv422_median1
utvideo_yuv444_709_gradient1
utvideo_yuv444_709_int_gradient1
utvideo_yuv444_709_int_median1
utvideo_yuv444_709_median1
7 days agon7.0.3mipslinuxgcc 10 (Ubuntu 10.3.0-1ubuntu1)
9 failed testsStatus
filter-bwdif10234
filter-metadata-signalstats-yuv420p101
filter-yadif10234
filter-yadif16234
sub-aqtitle234
sub-charenc234
sub-subviewer1234
sub2video_basic1
sub2video_time_limited1
7 days agon7.1.1-57-g1b48158a23mipslinuxgcc 10 (Ubuntu 10.3.0-1ubuntu1)
3 failed testsStatus
sub-aqtitle234
sub-charenc234
sub-subviewer1234
5 days agoN-120833-gdb2af6fd42parisclinuxgcc 11 (Ubuntu 11.4.0-1ubuntu1~22.04)
7 days agon5.1.7parisclinuxgcc 11 (Ubuntu 11.4.0-1ubuntu1~22.04)
7 days agon6.1.3parisclinuxgcc 11 (Ubuntu 11.4.0-1ubuntu1~22.04)
7 days agon7.0.3parisclinuxgcc 11 (Ubuntu 11.4.0-1ubuntu1~22.04)
7 days agon7.1.1-57-g1b48158a23parisclinuxgcc 11 (Ubuntu 11.4.0-1ubuntu1~22.04)
5 days agoN-120833-gdb2af6fd42parisclinuxgcc 11 (Ubuntu 11.4.0-1ubuntu1~22.04)--enable-shared
7 days agon5.1.7parisclinuxgcc 11 (Ubuntu 11.4.0-1ubuntu1~22.04)--enable-shared
7 days agon6.1.3parisclinuxgcc 11 (Ubuntu 11.4.0-1ubuntu1~22.04)--enable-shared
7 days agon7.0.3parisclinuxgcc 11 (Ubuntu 11.4.0-1ubuntu1~22.04)--enable-shared
7 days agon7.1.1-57-g1b48158a23parisclinuxgcc 11 (Ubuntu 11.4.0-1ubuntu1~22.04)--enable-shared
5 days agoN-120833-gdb2af6fd42ppclinuxgcc 11 (Ubuntu 11.4.0-1ubuntu1~22.04)
7 days agon5.1.7ppclinuxgcc 11 (Ubuntu 11.4.0-1ubuntu1~22.04)
7 days agon6.1.3ppclinuxgcc 11 (Ubuntu 11.4.0-1ubuntu1~22.04)
7 days agon7.0.3ppclinuxgcc 11 (Ubuntu 11.4.0-1ubuntu1~22.04)
7 days agon7.1.1-57-g1b48158a23ppclinuxgcc 11 (Ubuntu 11.4.0-1ubuntu1~22.04)
13 days agoN-120756-g8426622bb9ppclinuxgcc 14 (Debian 14.3.0-5)G5 PowerMac (32-bit + AltiVec)
1 failed testStatus
checkasm-llauddsp1
5 days agoN-120833-gdb2af6fd42ppc64linuxgcc 11 (Ubuntu 11.4.0-1ubuntu1~22.04)
7 days agon5.1.7ppc64linuxgcc 11 (Ubuntu 11.4.0-1ubuntu1~22.04)
7 days agon6.1.3ppc64linuxgcc 11 (Ubuntu 11.4.0-1ubuntu1~22.04)
7 days agon7.0.3ppc64linuxgcc 11 (Ubuntu 11.4.0-1ubuntu1~22.04)
7 days agon7.1.1-57-g1b48158a23ppc64linuxgcc 11 (Ubuntu 11.4.0-1ubuntu1~22.04)
2025-08-17N-120754-ga2cfaf1b91ppc64linuxgcc 14 (Debian 14.3.0-5)G5 PowerMac
5 hours agoN-120851-g7a774829f9ppc64linuxgcc 14 (Debian 14.3.0-5)G5 PowerMac
1 failed testStatus
checkasm-llauddsp1
11 days agon7.1.1-57-g1b48158a23ppc64linuxgcc 14 (Debian 14.3.0-5)G5 PowerMac (release/7.1)
1 failed testStatus
checkasm-sw_yuv2rgb1
13 days agoN-120756-g8426622bb9ppc64linuxgcc 14 (Debian 14.3.0-5)G5 PowerMac + Address Sanitizer
9 failed testsStatus
checkasm-llauddsp1
checkasm-sw_scale1
vc1-ism1
vc1_ilaced_twomv1
vc1_sa100911
vc1_sa101431
vc1_sa200211
vc1test_smm00051
wmv3-drm-dec1
105 minutes agoN-120851-g7a774829f9ppc64linuxgcc 14 (Debian 14.3.0-5)G5 PowerMac + Address Sanitizer
9 failed testsStatus
checkasm-llauddsp1
checkasm-sw_scale1
vc1-ism1
vc1_ilaced_twomv1
vc1_sa100911
vc1_sa101431
vc1_sa200211
vc1test_smm00051
wmv3-drm-dec1
13 days agoN-120756-g8426622bb9ppc64linuxgcc 14 (Debian 14.3.0-5)G5 PowerMac + UBsan
3 failed testsStatus
checkasm-llauddsp1
checkasm-sw_gbrp1
checkasm-sw_rgb1
3 hours agoN-120851-g7a774829f9ppc64linuxgcc 14 (Debian 14.3.0-5)G5 PowerMac + UBsan
2 failed testsStatus
checkasm-sw_gbrp1
checkasm-sw_rgb1
37 hours agoN-120848-g2fffa01ddbppc64linuxgcc 15 (GCC)POWER9 (Raptor Blackbird)
3 failed testsStatus
checkasm-llauddsp1
checkasm-sw_scale1
sws-floatimg-cmp1
10 days agon7.1.1-57-g1b48158a23ppc64linuxgcc 15 (GCC)POWER9 (release/7.1, Raptor Blackbird)
2 failed testsStatus
checkasm-llauddsp1
checkasm-sw_yuv2rgb1
8 hours agoN-120851-g7a774829f9riscv64linuxDebian clang version 17.0.6 (22+b2)RVA20 (Remlab.net)
7 hours agoN-120851-g7a774829f9riscv64linuxDebian clang version 18.1.8 (18+b1)RVA20 (Remlab.net)
6 hours agoN-120851-g7a774829f9riscv64linuxDebian clang version 19.1.7 (3+b1)RVA20 (Remlab.net)
10 hours agoN-120851-g7a774829f9riscv64linuxgcc 11 (Debian 11.5.0-1)RVA20 (Remlab.net)
5 days agoN-120833-gdb2af6fd42riscv64linuxgcc 11 (Ubuntu 11.4.0-1ubuntu1~22.04)
7 days agon5.1.7riscv64linuxgcc 11 (Ubuntu 11.4.0-1ubuntu1~22.04)
7 days agon6.1.3riscv64linuxgcc 11 (Ubuntu 11.4.0-1ubuntu1~22.04)
7 days agon7.0.3riscv64linuxgcc 11 (Ubuntu 11.4.0-1ubuntu1~22.04)
7 days agon7.1.1-57-g1b48158a23riscv64linuxgcc 11 (Ubuntu 11.4.0-1ubuntu1~22.04)
9 hours agoN-120851-g7a774829f9riscv64linuxgcc 12 (Debian 12.4.0-5)RVA20 (Remlab.net)
9 hours agoN-120851-g7a774829f9riscv64linuxgcc 13 (Debian 13.3.0-16)RVA20 (Remlab.net)
8 hours agoN-120851-g7a774829f9riscv64linuxgcc 14 (Debian 14.2.0-19)RVA20 (Remlab.net)
8 hours agoN-120851-g7a774829f9riscv64linuxgcc 14 (Debian 14.2.0-19)RVA22 + V (Remlab.net)
2 failed testsStatus
vsynth3-asv1BUS
vsynth3-asv2BUS
5 days agoN-120833-gdb2af6fd42s390xlinuxgcc 11 (Ubuntu 11.4.0-1ubuntu1~22.04)
7 days agon5.1.7s390xlinuxgcc 11 (Ubuntu 11.4.0-1ubuntu1~22.04)
7 days agon6.1.3s390xlinuxgcc 11 (Ubuntu 11.4.0-1ubuntu1~22.04)
7 days agon7.0.3s390xlinuxgcc 11 (Ubuntu 11.4.0-1ubuntu1~22.04)
7 days agon7.1.1-57-g1b48158a23s390xlinuxgcc 11 (Ubuntu 11.4.0-1ubuntu1~22.04)
5 days agoN-120833-gdb2af6fd42s390xlinuxgcc 11 (Ubuntu 11.4.0-1ubuntu1~22.04)--enable-shared
7 days agon5.1.7s390xlinuxgcc 11 (Ubuntu 11.4.0-1ubuntu1~22.04)--enable-shared
7 days agon6.1.3s390xlinuxgcc 11 (Ubuntu 11.4.0-1ubuntu1~22.04)--enable-shared
7 days agon7.0.3s390xlinuxgcc 11 (Ubuntu 11.4.0-1ubuntu1~22.04)--enable-shared
7 days agon7.1.1-57-g1b48158a23s390xlinuxgcc 11 (Ubuntu 11.4.0-1ubuntu1~22.04)--enable-shared
5 days agoN-120832-gfa23202cc7sh4linuxgcc 11 (Ubuntu 11.4.0-1ubuntu1~22.04)
6 failed testsStatus
acodec-dca1
acodec-dca21
atrac3-11
wmapro-2ch1
wmapro-5.11
wmapro-ism1
7 days agon5.1.7sh4linuxgcc 11 (Ubuntu 11.4.0-1ubuntu1~22.04)
2 failed testsStatus
atrac3-11
filter-metadata-avf-aphase-meter-mono1
7 days agon6.1.3sh4linuxgcc 11 (Ubuntu 11.4.0-1ubuntu1~22.04)
4 failed testsStatus
atrac3-11
wmapro-2ch1
wmapro-5.11
wmapro-ism1
7 days agon7.0.3sh4linuxgcc 11 (Ubuntu 11.4.0-1ubuntu1~22.04)
4 failed testsStatus
atrac3-11
wmapro-2ch1
wmapro-5.11
wmapro-ism1
7 days agon7.1.1-57-g1b48158a23sh4linuxgcc 11 (Ubuntu 11.4.0-1ubuntu1~22.04)
4 failed testsStatus
atrac3-11
wmapro-2ch1
wmapro-5.11
wmapro-ism1
5 days agoN-120832-gfa23202cc7sh4linuxgcc 11 (Ubuntu 11.4.0-1ubuntu1~22.04)--enable-shared
7 days agon5.1.7sh4linuxgcc 11 (Ubuntu 11.4.0-1ubuntu1~22.04)--enable-shared
7 days agon6.1.3sh4linuxgcc 11 (Ubuntu 11.4.0-1ubuntu1~22.04)--enable-shared
7 days agon7.0.3sh4linuxgcc 11 (Ubuntu 11.4.0-1ubuntu1~22.04)--enable-shared
7 days agon7.1.1-57-g1b48158a23sh4linuxgcc 11 (Ubuntu 11.4.0-1ubuntu1~22.04)--enable-shared
5 days agoN-120832-gfa23202cc7sparc64linuxgcc 11 (Ubuntu 11.4.0-1ubuntu1~22.04)
7 days agon5.1.7sparc64linuxgcc 11 (Ubuntu 11.4.0-1ubuntu1~22.04)
7 days agon6.1.3sparc64linuxgcc 11 (Ubuntu 11.4.0-1ubuntu1~22.04)
7 days agon7.0.3sparc64linuxgcc 11 (Ubuntu 11.4.0-1ubuntu1~22.04)
7 days agon7.1.1-57-g1b48158a23sparc64linuxgcc 11 (Ubuntu 11.4.0-1ubuntu1~22.04)
5 days agoN-120832-gfa23202cc7sparc64linuxgcc 11 (Ubuntu 11.4.0-1ubuntu1~22.04)--enable-shared
7 days agon5.1.7sparc64linuxgcc 11 (Ubuntu 11.4.0-1ubuntu1~22.04)--enable-shared
7 days agon6.1.3sparc64linuxgcc 11 (Ubuntu 11.4.0-1ubuntu1~22.04)--enable-shared
7 days agon7.0.3sparc64linuxgcc 11 (Ubuntu 11.4.0-1ubuntu1~22.04)--enable-shared
7 days agon7.1.1-57-g1b48158a23sparc64linuxgcc 11 (Ubuntu 11.4.0-1ubuntu1~22.04)--enable-shared
8 hours agoN-120851-g7a774829f9x86_32mingw32clang version 22.0.0git (https%3a//github.com/llvm/llvm-project 6dfd8d0ab46e64d0c30d2b9c60f212b50171fc9d)
5 days agoN-120832-gfa23202cc7x86_32mingw32gcc 10-win32 (GCC) 20220113
CC	libavfilter/af_adrc.o
CC	libavfilter/af_adynamicequalizer.o
CC	libavfilter/af_adynamicsmooth.o
CC	libavfilter/af_aecho.o
CC	libavfilter/af_aemphasis.o
CC	libavfilter/af_aexciter.o
CC	libavfilter/af_afade.o
CC	libavfilter/af_afftdn.o
CC	libavfilter/af_afftfilt.o
CC	libavfilter/af_afir.o
CC	libavfilter/af_aformat.o
CC	libavfilter/af_afreqshift.o
src/libavformat/tls_schannel.c: In function 'tls_handshake':
src/libavformat/tls_schannel.c:1097:58: error: 'SECPKG_ATTR_DTLS_MTU' undeclared (first use in this function); did you mean 'SECPKG_ATTR_TARGET'?
 1097 |         sspi_ret = SetContextAttributes(&c->ctxt_handle, SECPKG_ATTR_DTLS_MTU, &mtu, sizeof(mtu));
      |                                                          ^~~~~~~~~~~~~~~~~~~~
      |                                                          SECPKG_ATTR_TARGET
src/libavformat/tls_schannel.c:1097:58: note: each undeclared identifier is reported only once for each function it appears in
make: *** [/home/fate/ffmpeg/ffbuild/common.mak:81: libavformat/tls_schannel.o] Error 1
make: *** Waiting for unfinished jobs....
7 days agon5.1.7x86_32mingw32gcc 10-win32 (GCC) 20220113
7 days agon6.1.3x86_32mingw32gcc 10-win32 (GCC) 20220113
7 days agon7.0.3x86_32mingw32gcc 10-win32 (GCC) 20220113
7 days agon7.1.1-57-g1b48158a23x86_32mingw32gcc 10-win32 (GCC) 20220113
5 days agoN-120832-gfa23202cc7x86_32mingw32gcc 10-win32 (GCC) 20220113--enable-shared
CC	libavfilter/af_aecho.o
CC	libavfilter/af_aemphasis.o
CC	libavfilter/af_aexciter.o
CC	libavfilter/af_afade.o
CC	libavfilter/af_afftdn.o
CC	libavfilter/af_afftfilt.o
CC	libavfilter/af_afir.o
CC	libavfilter/af_aformat.o
CC	libavfilter/af_afreqshift.o
CC	libavfilter/af_afwtdn.o
CC	libavfilter/af_agate.o
CC	libavfilter/af_aiir.o
src/libavformat/tls_schannel.c: In function 'tls_handshake':
src/libavformat/tls_schannel.c:1097:58: error: 'SECPKG_ATTR_DTLS_MTU' undeclared (first use in this function); did you mean 'SECPKG_ATTR_TARGET'?
 1097 |         sspi_ret = SetContextAttributes(&c->ctxt_handle, SECPKG_ATTR_DTLS_MTU, &mtu, sizeof(mtu));
      |                                                          ^~~~~~~~~~~~~~~~~~~~
      |                                                          SECPKG_ATTR_TARGET
src/libavformat/tls_schannel.c:1097:58: note: each undeclared identifier is reported only once for each function it appears in
make: *** [/home/fate/ffmpeg/ffbuild/common.mak:81: libavformat/tls_schannel.o] Error 1
make: *** Waiting for unfinished jobs....
7 days agon5.1.7x86_32mingw32gcc 10-win32 (GCC) 20220113--enable-shared
7 days agon6.1.3x86_32mingw32gcc 10-win32 (GCC) 20220113--enable-shared
7 days agon7.0.3x86_32mingw32gcc 10-win32 (GCC) 20220113--enable-shared
7 days agon7.1.1-57-g1b48158a23x86_32mingw32gcc 10-win32 (GCC) 20220113--enable-shared
10 hours agoN-120851-g7a774829f9x86_32mingw32gcc 14.3.0 (GCC)dll, native windows
8 hours agoN-120851-g7a774829f9x86_32win32clang version 22.0.0git (https%3a//github.com/llvm/llvm-project 6dfd8d0ab46e64d0c30d2b9c60f212b50171fc9d)MSVC 2022 SDK
8 hours agoN-120851-g7a774829f9x86_32win32Microsoft (R) C/C++ Optimizing Compiler Version 19.43.34808 for x86
10 hours agoN-120851-g7a774829f9x86_32win32Microsoft (R) C/C++ Optimizing Compiler Version 19.44.35213 for x86VS2022
9 hours agoN-120851-g7a774829f9x86_32win32Microsoft (R) C/C++ Optimizing Compiler Version 19.44.35213 for x86VS2022 --enable-shared
1 failed testStatus
movenc1
9 hours agoN-120851-g7a774829f9x86_32win32Microsoft (R) C/C++ Optimizing Compiler Version 19.44.35213 for x86VS2022 --enable-shared dynlink CRT
1 failed testStatus
movenc1
9 hours agoN-120851-g7a774829f9x86_32win32Microsoft (R) C/C++ Optimizing Compiler Version 19.44.35213 for x86VS2022 dynlink CRT
34 minutes agoN-120855-g2296a9c1bcx86_64darwinApple clang version 12.0.5 (clang-1205.0.22.9)macOS 11 SDK, Rosetta2
54 minutes agoN-120855-g2296a9c1bcx86_64darwinApple clang version 12.0.5 (clang-1205.0.22.9)OS X 10.6 (Rosetta2)
61 minutes agoN-120855-g2296a9c1bcx86_64darwinApple clang version 12.0.5 (clang-1205.0.22.9)OS X 10.8 (Rosetta2)
64 minutes agoN-120855-g2296a9c1bcx86_64linuxgcc 11 (Ubuntu 11.4.0-1ubuntu1~22.04.2)AVX512-ICL NUC
8 hours agoN-120851-g7a774829f9x86_64linuxgcc 14.2.1 (GCC) 20240910--disable-avcodec
8 hours agoN-120851-g7a774829f9x86_64linuxgcc 14.2.1 (GCC) 20240910--disable-avdevice
8 hours agoN-120851-g7a774829f9x86_64linuxgcc 14.2.1 (GCC) 20240910--disable-avfilter
8 hours agoN-120851-g7a774829f9x86_64linuxgcc 14.2.1 (GCC) 20240910--disable-avformat
7 hours agoN-120851-g7a774829f9x86_64linuxgcc 14.2.1 (GCC) 20240910--disable-gpl
8 hours agoN-120851-g7a774829f9x86_64linuxgcc 14.2.1 (GCC) 20240910--disable-mmx
8 hours agoN-120851-g7a774829f9x86_64linuxgcc 14.2.1 (GCC) 20240910--disable-optimizations
8 hours agoN-120851-g7a774829f9x86_64linuxgcc 14.2.1 (GCC) 20240910--disable-swresample
8 hours agoN-120851-g7a774829f9x86_64linuxgcc 14.2.1 (GCC) 20240910--disable-swscale
8 hours agoN-120851-g7a774829f9x86_64linuxgcc 14.2.1 (GCC) 20240910--disable-zlib
7 hours agoN-120851-g7a774829f9x86_64linuxgcc 14.2.1 (GCC) 20240910--enable-random
8 hours agoN-120851-g7a774829f9x86_64linuxgcc 14.2.1 (GCC) 20240910--enable-shared + libs
8 hours agoN-120851-g7a774829f9x86_64linuxgcc 14.2.1 (GCC) 20240910-DDEBUG -DTRACE -DCHECKED
9 hours agoN-120851-g7a774829f9x86_64linuxgcc 14.2.1 (GCC) 20240910assert-level=2
9 hours agoN-120851-g7a774829f9x86_64linuxgcc 14.2.1 (GCC) 20240910checkheaders
8 hours agoN-120851-g7a774829f9x86_64linuxgcc 14.2.1 (GCC) 20240910Examples
7 hours agoN-120851-g7a774829f9x86_64linuxgcc 14.2.1 (GCC) 20240910GCC ThreadSanitizer (tsan)
86 failed testsStatus
api-h264-slice66
ffmpeg-streamloop-transcode-av66
filter-metadata-cropdetect166
filter-overlay_yuva420_yuva42066
force_key_frames66
h264-338666
h264-conformance-ba1_ft_c66
h264-conformance-basqp1_sony_c66
h264-conformance-cabastbr3_sony_b66
h264-conformance-camasl3_sony_b66
h264-conformance-ci1_ft_b66
h264-conformance-cvfc1_sony_c66
h264-conformance-cvfi1_sony_d66
h264-conformance-cvfi2_sony_h66
h264-conformance-cvnlfi1_sony_c66
h264-conformance-cvnlfi2_sony_h66
h264-conformance-frext-hpcafl_bcrm_c66
h264-conformance-frext-hpcaflnl_bcrm_c66
h264-conformance-frext-hpcvfl_bcrm_a66
h264-conformance-frext-hpcvflnl_bcrm_a66
h264-conformance-frext-pph422i2_panasonic_a66
h264-conformance-frext-pph422i3_panasonic_a66
h264-conformance-frext-pph422i4_panasonic_a66
h264-conformance-frext-pph422i6_panasonic_a66
h264-conformance-mr1_bt_a66
h264-conformance-sl1_sva_b66
h264-conformance-slice2_field_aurora466
h264-conformance-sva_cl1_e66
h264-conformance-sva_fm1_e66
h264-encparams66
h264-timecode66
h264-xavc-438966
lavf-avi66
lavf-mkv66
lavf-mov66
lavf-mov_rtphint66
lavf-nut66
m4v66
m4v-cfr66
mov-invalid-elst-entry-count66
mpeg4-resolution-change-down-down66
mpeg4-resolution-change-down-up66
mpeg4-resolution-change-up-down66
mpeg4-resolution-change-up-up66
mpeg4-simple-studio-profile66
vsynth1-mpeg466
vsynth1-mpeg4-adap66
vsynth1-mpeg4-adv66
vsynth1-mpeg4-error66
vsynth1-mpeg4-nr66
vsynth1-mpeg4-nsse66
vsynth1-mpeg4-qpel66
vsynth1-mpeg4-qprd66
vsynth1-mpeg4-rc66
vsynth1-mpeg4-thread66
vsynth2-mpeg466
vsynth2-mpeg4-adap66
vsynth2-mpeg4-adv66
vsynth2-mpeg4-error66
vsynth2-mpeg4-nr66
vsynth2-mpeg4-nsse66
vsynth2-mpeg4-qpel66
vsynth2-mpeg4-qprd66
vsynth2-mpeg4-rc66
vsynth2-mpeg4-thread66
vsynth3-mpeg466
vsynth3-mpeg4-adap66
vsynth3-mpeg4-adv66
vsynth3-mpeg4-error66
vsynth3-mpeg4-nr66
vsynth3-mpeg4-nsse66
vsynth3-mpeg4-qpel66
vsynth3-mpeg4-qprd66
vsynth3-mpeg4-rc66
vsynth3-mpeg4-thread66
vsynth_lena-mpeg466
vsynth_lena-mpeg4-adap66
vsynth_lena-mpeg4-adv66
vsynth_lena-mpeg4-error66
vsynth_lena-mpeg4-nr66
vsynth_lena-mpeg4-nsse66
vsynth_lena-mpeg4-qpel66
vsynth_lena-mpeg4-qprd66
vsynth_lena-mpeg4-rc66
vsynth_lena-mpeg4-thread66
xvid-idct66
7 hours agoN-120851-g7a774829f9x86_64linuxgcc 14.2.1 (GCC) 20240910GCC ThreadSanitizer (tsan) / slice threading
65 failed testsStatus
api-h264-slice66
ffmpeg-loopback-decoding66
ffmpeg-streamloop-transcode-av66
filter-metadata-cropdetect166
filter-overlay_yuva420_yuva42066
h264-338666
h264-conformance-ba1_ft_c66
h264-conformance-basqp1_sony_c66
h264-conformance-cabaci3_sony_b66
h264-conformance-cabast3_sony_e66
h264-conformance-cabastbr3_sony_b66
h264-conformance-ci1_ft_b66
h264-conformance-cvfc1_sony_c66
h264-conformance-cvfi1_sony_d66
h264-conformance-cvfi2_sony_h66
h264-conformance-cvnlfi1_sony_c66
h264-conformance-cvnlfi2_sony_h66
h264-conformance-mr1_bt_a66
h264-conformance-sl1_sva_b66
h264-conformance-slice2_field_aurora466
h264-conformance-sva_base_b66
h264-conformance-sva_cl1_e66
h264-conformance-sva_fm1_e66
lavf-avi66
lavf-ismv66
lavf-mkv66
lavf-mkv_attachment66
lavf-mov66
lavf-mov_hybrid_frag66
lavf-mov_rtphint66
lavf-mp466
lavf-nut66
vsynth1-ffv166
vsynth1-ffv1-2pass66
vsynth1-ffv1-2pass1066
vsynth1-ffv1-v3-bgr066
vsynth1-ffv1-v3-rgb4866
vsynth1-ffv1-v3-yuv420p66
vsynth1-ffv1-v3-yuv422p1066
vsynth1-ffv1-v3-yuv444p1666
vsynth2-ffv166
vsynth2-ffv1-2pass66
vsynth2-ffv1-2pass1066
vsynth2-ffv1-v3-bgr066
vsynth2-ffv1-v3-rgb4866
vsynth2-ffv1-v3-yuv420p66
vsynth2-ffv1-v3-yuv422p1066
vsynth2-ffv1-v3-yuv444p1666
vsynth3-ffv166
vsynth3-ffv1-2pass66
vsynth3-ffv1-2pass1066
vsynth3-ffv1-v266
vsynth3-ffv1-v3-bgr066
vsynth3-ffv1-v3-rgb4866
vsynth3-ffv1-v3-yuv420p66
vsynth3-ffv1-v3-yuv422p1066
vsynth3-ffv1-v3-yuv444p1666
vsynth_lena-ffv166
vsynth_lena-ffv1-2pass66
vsynth_lena-ffv1-2pass1066
vsynth_lena-ffv1-v3-bgr066
vsynth_lena-ffv1-v3-rgb4866
vsynth_lena-ffv1-v3-yuv420p66
vsynth_lena-ffv1-v3-yuv422p1066
vsynth_lena-ffv1-v3-yuv444p1666
7 hours agoN-120851-g7a774829f9x86_64linuxgcc 14.2.1 (GCC) 20240910GCC UndefinedBehaviorSanitizer (ubsan)
2 failed testsStatus
checkasm-sw_gbrp1
checkasm-sw_rgb1
7 hours agoN-120851-g7a774829f9x86_64linuxgcc 14.2.1 (GCC) 20240910LTO (shared)
6 hours agoN-120851-g7a774829f9x86_64linuxgcc 14.2.1 (GCC) 20240910threads auto
6 hours agoN-120851-g7a774829f9x86_64linuxgcc 14.2.1 (GCC) 20240910THREADS=7 THREAD_TYPE=slice
59 minutes agoN-120851-g7a774829f9x86_64linuxgcc 14.2.1 (GCC) 20240910valgrind-3.23.0 full
9 hours agoN-120851-g7a774829f9x86_64linuxgcc 14.2.1 (GCC) 20240910valgrind-3.23.0 no-undef
7 hours agoN-120851-g7a774829f9x86_64linuxgcc 14.2.1 (GCC) 202409102 threads
6 hours agoN-120851-g7a774829f9x86_64linuxgcc 14.2.1 (GCC) 202409108 threads
7 hours agoN-120851-g7a774829f9x86_64linuxgcc 14.2.1 (GCC) 2024091016 threads
39 hours agoN-120848-g2fffa01ddbx86_64linuxgcc 15 (GCC)GCC AddressSanitizer (asan), asm disabled
40 hours agoN-120846-g4ede75b5f4x86_64linuxgcc 16 (Debian 20250828-1)GCC AMD64
39 hours agoN-120847-g7252f6c0bfx86_64linuxUbuntu clang version 22.0.0 (++20250812082130+296e057d0bf2-1~exp1~20250812082146.1091)Clang ASAN/UBSAN
39 hours agoN-120847-g7252f6c0bfx86_64linuxUbuntu clang version 22.0.0 (++20250812082130+296e057d0bf2-1~exp1~20250812082146.1091)Clang ASAN/UBSAN/ASM
2 failed testsStatus
checkasm-sw_gbrp1
checkasm-sw_rgb1
39 hours agoN-120847-g7252f6c0bfx86_64linuxUbuntu clang version 22.0.0 (++20250812082130+296e057d0bf2-1~exp1~20250812082146.1091)Clang MSAN
8 hours agoN-120851-g7a774829f9x86_64mingw32clang version 22.0.0git (https%3a//github.com/llvm/llvm-project 6dfd8d0ab46e64d0c30d2b9c60f212b50171fc9d)
5 days agoN-120832-gfa23202cc7x86_64mingw32gcc 10-win32 (GCC) 20220113
CC	libavfilter/avf_showspatial.o
CC	libavfilter/avf_showspectrum.o
CC	libavfilter/avf_showvolume.o
CC	libavfilter/avf_showwaves.o
CC	libavfilter/avfilter.o
CC	libavfilter/avfiltergraph.o
CC	libavfilter/bbox.o
CC	libavfilter/boxblur.o
CC	libavfilter/buffersink.o
CC	libavfilter/buffersrc.o
CC	libavfilter/bwdifdsp.o
CC	libavfilter/ccfifo.o
src/libavformat/tls_schannel.c: In function 'tls_handshake':
src/libavformat/tls_schannel.c:1097:58: error: 'SECPKG_ATTR_DTLS_MTU' undeclared (first use in this function); did you mean 'SECPKG_ATTR_TARGET'?
 1097 |         sspi_ret = SetContextAttributes(&c->ctxt_handle, SECPKG_ATTR_DTLS_MTU, &mtu, sizeof(mtu));
      |                                                          ^~~~~~~~~~~~~~~~~~~~
      |                                                          SECPKG_ATTR_TARGET
src/libavformat/tls_schannel.c:1097:58: note: each undeclared identifier is reported only once for each function it appears in
make: *** [/home/fate/ffmpeg/ffbuild/common.mak:81: libavformat/tls_schannel.o] Error 1
make: *** Waiting for unfinished jobs....
7 days agon5.1.7x86_64mingw32gcc 10-win32 (GCC) 20220113
7 days agon6.1.3x86_64mingw32gcc 10-win32 (GCC) 20220113
7 days agon7.0.3x86_64mingw32gcc 10-win32 (GCC) 20220113
7 days agon7.1.1-57-g1b48158a23x86_64mingw32gcc 10-win32 (GCC) 20220113
1 failed testStatus
iamf-5_1-copy1
5 days agoN-120832-gfa23202cc7x86_64mingw32gcc 10-win32 (GCC) 20220113--enable-shared
CC	libavfilter/avfiltergraph.o
CC	libavfilter/bbox.o
CC	libavfilter/boxblur.o
CC	libavfilter/buffersink.o
CC	libavfilter/buffersrc.o
CC	libavfilter/bwdifdsp.o
CC	libavfilter/ccfifo.o
CC	libavfilter/colorspace.o
CC	libavfilter/colorspacedsp.o
CC	libavfilter/drawutils.o
CC	libavfilter/ebur128.o
CC	libavfilter/edge_common.o
src/libavformat/tls_schannel.c: In function 'tls_handshake':
src/libavformat/tls_schannel.c:1097:58: error: 'SECPKG_ATTR_DTLS_MTU' undeclared (first use in this function); did you mean 'SECPKG_ATTR_TARGET'?
 1097 |         sspi_ret = SetContextAttributes(&c->ctxt_handle, SECPKG_ATTR_DTLS_MTU, &mtu, sizeof(mtu));
      |                                                          ^~~~~~~~~~~~~~~~~~~~
      |                                                          SECPKG_ATTR_TARGET
src/libavformat/tls_schannel.c:1097:58: note: each undeclared identifier is reported only once for each function it appears in
make: *** [/home/fate/ffmpeg/ffbuild/common.mak:81: libavformat/tls_schannel.o] Error 1
make: *** Waiting for unfinished jobs....
7 days agon5.1.7x86_64mingw32gcc 10-win32 (GCC) 20220113--enable-shared
7 days agon6.1.3x86_64mingw32gcc 10-win32 (GCC) 20220113--enable-shared
7 days agon7.0.3x86_64mingw32gcc 10-win32 (GCC) 20220113--enable-shared
7 days agon7.1.1-57-g1b48158a23x86_64mingw32gcc 10-win32 (GCC) 20220113--enable-shared
5 days agoN-120832-gfa23202cc7x86_64mingw32gcc 10-win32 (GCC) 20220113--enable-xmm-clobber-test
CC	libavfilter/ccfifo.o
CC	libavfilter/colorspace.o
CC	libavfilter/colorspacedsp.o
CC	libavfilter/drawutils.o
CC	libavfilter/ebur128.o
CC	libavfilter/edge_common.o
CC	libavfilter/f_bench.o
CC	libavfilter/f_cue.o
CC	libavfilter/f_drawgraph.o
CC	libavfilter/f_ebur128.o
CC	libavfilter/f_graphmonitor.o
CC	libavfilter/f_interleave.o
src/libavformat/tls_schannel.c: In function 'tls_handshake':
src/libavformat/tls_schannel.c:1097:58: error: 'SECPKG_ATTR_DTLS_MTU' undeclared (first use in this function); did you mean 'SECPKG_ATTR_TARGET'?
 1097 |         sspi_ret = SetContextAttributes(&c->ctxt_handle, SECPKG_ATTR_DTLS_MTU, &mtu, sizeof(mtu));
      |                                                          ^~~~~~~~~~~~~~~~~~~~
      |                                                          SECPKG_ATTR_TARGET
src/libavformat/tls_schannel.c:1097:58: note: each undeclared identifier is reported only once for each function it appears in
make: *** [/home/fate/ffmpeg/ffbuild/common.mak:81: libavformat/tls_schannel.o] Error 1
make: *** Waiting for unfinished jobs....
7 days agon5.1.7x86_64mingw32gcc 10-win32 (GCC) 20220113--enable-xmm-clobber-test
7 days agon6.1.3x86_64mingw32gcc 10-win32 (GCC) 20220113--enable-xmm-clobber-test
1 failed testStatus
filter-pixfmts-pullup1
7 days agon7.0.3x86_64mingw32gcc 10-win32 (GCC) 20220113--enable-xmm-clobber-test
7 days agon7.1.1-57-g1b48158a23x86_64mingw32gcc 10-win32 (GCC) 20220113--enable-xmm-clobber-test
10 hours agoN-120851-g7a774829f9x86_64mingw32gcc 14.3.0 (GCC)native windows
8 hours agoN-120851-g7a774829f9x86_64win32clang version 22.0.0git (https%3a//github.com/llvm/llvm-project 6dfd8d0ab46e64d0c30d2b9c60f212b50171fc9d)MSVC 2022 SDK
8 hours agoN-120851-g7a774829f9x86_64win32Microsoft (R) C/C++ Optimizing Compiler Version 19.43.34808 for x64
39 hours agoN-120846-g4ede75b5f4x86_64win64clang version 19.1.5VS2022 Clang AMD64
39 hours agoN-120846-g4ede75b5f4x86_64win64clang version 19.1.5VS2022 Clang AMD64 (ASAN)
40 hours agoN-120846-g4ede75b5f4x86_64win64clang version 19.1.5VS2022 Clang AMD64 (shared)
39 hours agoN-120846-g4ede75b5f4x86_64win64clang version 19.1.5VS2022 Clang-CL AMD64
39 hours agoN-120846-g4ede75b5f4x86_64win64clang version 19.1.5VS2022 Clang-CL AMD64 (ASAN)
40 hours agoN-120846-g4ede75b5f4x86_64win64clang version 19.1.5VS2022 Clang-CL AMD64 (shared)
8 hours agoN-120851-g7a774829f9x86_64win64Microsoft (R) C/C++ Optimizing Compiler Version 19.44.35213 for x64VS2022
39 hours agoN-120846-g4ede75b5f4x86_64win64Microsoft (R) C/C++ Optimizing Compiler Version 19.44.35215 for x64VS2022 MSVC AMD64
39 hours agoN-120846-g4ede75b5f4x86_64win64Microsoft (R) C/C++ Optimizing Compiler Version 19.44.35215 for x64VS2022 MSVC AMD64 (ASAN)
39 hours agoN-120846-g4ede75b5f4x86_64win64Microsoft (R) C/C++ Optimizing Compiler Version 19.44.35215 for x64VS2022 MSVC AMD64 (Assert Level 2)
39 hours agoN-120846-g4ede75b5f4x86_64win64Microsoft (R) C/C++ Optimizing Compiler Version 19.44.35215 for x64VS2022 MSVC AMD64 (Debug)
40 hours agoN-120846-g4ede75b5f4x86_64win64Microsoft (R) C/C++ Optimizing Compiler Version 19.44.35215 for x64VS2022 MSVC AMD64 (shared)